{"text_format":"1","workbook":"xlsx","n_sheets":5,"sheets":["Inschrijfformulier","Vraagprogramma","Handleiding","Verenigingen","Inschijfgeld ed"],"not_rendered":{"charts":0,"images":3,"macros":1,"external_links":1,"defined_names":11,"comments":1,"pivot_tables":0},"unopened":[],"bounds":{"document_bytes":16777216,"sheet_cells":100000,"rows_first":2000,"rows_last":500,"rows_between":2000,"halvings":0,"cell_chars":16384,"cell_head_chars":4096},"cells_cut":0,"cells_raw":0,"read":"whole","date_system":"1900"}

{"sheet":"Inschrijfformulier","index":0,"n_rows":81,"n_cols":35,"rows_kept":81,"cut":false,"hidden":false,"merged":[[14,32,14,33],[15,32,15,33],[31,32,31,33],[32,32,32,33],[16,32,16,33],[19,32,19,33],[30,32,30,33],[48,32,48,33],[41,32,41,33],[37,32,37,33],[17,32,17,33],[3,32,3,34],[76,2,76,3],[15,7,15,10],[14,8,14,9],[80,1,80,12],[79,1,79,12],[76,6,76,10],[66,6,66,10],[78,1,78,12],[77,1,77,12],[74,1,74,12],[72,1,73,12],[76,4,76,5],[18,4,18,12],[18,2,18,3],[21,2,21,3],[22,2,22,3],[23,2,23,3],[24,2,24,3],[6,1,6,12],[68,1,68,12],[70,1,70,12],[10,4,10,6],[11,4,11,6],[0,1,0,12],[1,1,1,12],[2,1,2,12],[4,1,4,12],[5,1,5,12],[12,2,12,3],[13,2,13,3],[14,2,14,3],[16,2,16,3],[7,2,7,3],[8,2,8,3],[9,2,9,3],[10,2,10,3],[11,2,11,3],[13,4,13,11],[8,8,8,9],[9,8,9,9],[10,8,10,9],[11,8,11,9],[12,8,12,9],[7,4,7,12],[8,4,8,6],[9,4,9,6],[12,4,12,6],[63,2,63,3],[64,2,64,3],[55,2,55,3],[56,2,56,3],[57,2,57,3],[58,2,58,3],[59,2,59,3],[61,2,61,3],[62,2,62,3],[60,2,60,3],[53,2,53,3],[54,2,54,3],[17,7,17,10],[17,4,17,6],[20,2,20,3],[19,2,19,3],[45,2,45,3],[46,2,46,3],[47,2,47,3],[48,2,48,3],[49,2,49,3],[40,2,40,3],[41,2,41,3],[42,2,42,3],[43,2,43,3],[44,2,44,3],[35,2,35,3],[25,2,25,3],[26,2,26,3],[27,2,27,3],[28,2,28,3],[29,2,29,3],[36,2,36,3],[37,2,37,3],[0,0,3,0],[4,32,4,34],[21,32,21,33],[22,32,22,33],[27,32,27,33],[26,32,26,33],[50,2,50,3],[51,2,51,3],[52,2,52,3],[38,2,38,3],[39,2,39,3],[30,2,30,3],[31,2,31,3],[32,2,32,3],[33,2,33,3],[34,2,34,3],[11,32,11,33],[12,32,12,33],[13,32,13,33],[6,32,6,33],[7,32,7,33],[8,32,8,33],[9,32,9,33],[10,32,10,33]]}
["CONTROLE",{"$f":"'Inschijfgeld ed'!B27","v":"v.v De Nachtegaal"}]
[null,{"$f":"'Inschijfgeld ed'!B28","v":"Heerjansdam"}]
[null,{"$f":"'Inschijfgeld ed'!B29","v":"AANGESLOTEN BIJ DE NEDERLANDSE BOND VAN VOGELLIEFHEBBERS"}]
[null,null,null,null,null,null,null,null,null,null,null,null,null,null,null,null,null,null,null,null,null,null,null,null,null,null,null,null,null,null,null,null,"VERGEET ONDERSTAANDE NIET IN TE VULLEN"]
[">>>","INSCHRIJFFORMULIER",null,null,null,null,null,null,null,null,null,null,null,null,null,null,null,null,null,null,null,null,null,null,null,null,null,null,null,null,null,null,"(als u een van de onderstaande correct ingevuld heeft is het vak groen)"]
[">>>",{"$f":"'Inschijfgeld ed'!B31","v":"Regionale Tentoonstelling 2021"},null,null,null,null,null,null,null,null,null,null,null,null,null,null,null,null,null,null,null,null,null,null,null,null,null,null,null,null,null,null,"Correct ingevuld","Nog niet en/of niet correct ingevuld","Regel"]
["▼▼","Uitleg over wat u in de gele vakken in moet vullen? Ga met uw muis op het vakje staan met het rode hoekje.",null,null,null,null,null,null,null,null,null,null,null,null,{"$f":"O8+O16","v":0},null,null,"Ja",null,null,null,null,null,null,null,null,null,null,null,null,null,null,"Kweeknummer nog invullen (verplicht) ",null,"C8"]
[">>>","Kweeknummer:",null,null,"TOTAAL INSCHRIJFGELD",null,null,null,null,null,null,null,null,null,{"$f":"LEN(C8)","v":0},{"$f":"IF(O8=4,0,IF(C8=\"\",0,LEN(C8)))","v":0},null,"Nee",null,null,null,null,null,null,null,null,null,null,null,null,null,null,"Ander C.O.M. nummer invullen (niet verplicht) ",null,"C9"]
[">>>","Ander C.O.M. nummer:",null,null,"Enkelingen:",null,null,{"$f":"G66","v":0},"x",null,{"$f":"IF(C18=\"Ja\",'Inschijfgeld ed'!B9,'Inschijfgeld ed'!B8)","v":1},"=",{"$f":"H9*K9","v":0},null,0,{"$f":"IF(O9<10,0,IF(C9=\"\",0,LEN(C9)))","v":0},null,null,null,null,null,null,null,null,null,null,null,null,null,null,null,null,"Uw naam nog invullen (verplicht - Achternaam - Voorl. - Tussenvoegsel) ",null,"C10"]
[">>>","Naam:",null,null,"Stellen:",null,null,{"$f":"H66","v":0},"x",null,{"$f":"IF(C18=\"Ja\",'Inschijfgeld ed'!B17,'Inschijfgeld ed'!B16)","v":2},"=",{"$f":"H10*K10","v":0},null,0,{"$f":"IF(O10<45,0,IF(C10=\"\",0,LEN(C10)))","v":0},null,null,null,null,null,null,null,null,null,null,null,null,null,null,null,null,"Uw adres nog invullen (verplicht) ",null,"C11"]
[">>>","Adres:",null,null,"Stammen:",null,null,{"$f":"I66","v":0},"x",null,{"$f":"IF(C18=\"Ja\",'Inschijfgeld ed'!B13,'Inschijfgeld ed'!B12)","v":4},"=",{"$f":"H11*K11","v":0},null,0,{"$f":"IF(O11<30,0,IF(C11=\"\",0,LEN(C11)))","v":0},null,null,null,null,null,null,null,null,null,null,null,null,null,null,null,null,"Uw postcode nog invullen (verplicht)",null,"C12"]
[">>>","Postcode:",null,null,"Open Klasse (O.E.K.):",null,null,{"$f":"J66","v":0},"x",null,{"$f":"IF(C18=\"Ja\",'Inschijfgeld ed'!B9,'Inschijfgeld ed'!B8)","v":1},"=",{"$f":"H12*K12","v":0},null,0,{"$f":"IF(O12=7,0,IF(C12=\"\",0,LEN(C12)))","v":0},null,null,null,null,null,null,null,null,null,null,null,null,null,null,null,null,"Uw woonplaats nog invullen (verplicht) ",null,"C13"]
[">>>","Woonplaats:",null,null,"Open Klasse (O.K.):",null,null,{"$f":"K66","v":0},"x",null,{"$f":"IF(C18=\"Ja\",'Inschijfgeld ed'!B9,'Inschijfgeld ed'!B8)","v":1},"=",{"$f":"H13*K13","v":0},null,0,{"$f":"IF(O13<30,0,IF(C13=\"\",0,LEN(C13)))","v":0},null,null,null,null,null,null,null,null,null,null,null,null,null,null,null,null,"Uw telefoonummer nog invullen (bijv. 000-0000000) (niet verplicht) ",null,"C14"]
[">>>","Telefoonnummer: ",null,null,"Admi-, portokosten en verplichte catalogus:",null,null,null,null,null,null,null,{"$f":"IF(C18=\"Ja\",'Inschijfgeld ed'!B21,'Inschijfgeld ed'!B20)","v":5},null,0,{"$f":"IF(O14<20,0,IF(C14=\"\",0,LEN(C14)))","v":0},null,null,null,null,null,null,null,null,null,null,null,null,null,null,null,null,"Uw mobielnummer nog invullen (bijv. 06-00000000) (niet verplicht) ",null,"C15"]
[">>>","Mobielnummer: ",null,null,"Evt. kooihuur:",null,null,{"$f":"M66","v":0},"x",null,{"$f":"IF(C18=\"Ja\",'Inschijfgeld ed'!B25,'Inschijfgeld ed'!B24)","v":2},"=",{"$f":"H15*K15","v":0},null,0,{"$f":"IF(O15<20,0,IF(C15=\"\",0,LEN(C15)))","v":0},null,null,null,null,null,null,null,null,null,null,null,null,null,null,null,null,"De code van uw verenigingen nog invullen (verplicht) ",null,"C16"]
[">>>","Lid afdeling: (code)",null,{"$f":"IF(C16=\"\",\"\",IFERROR(VLOOKUP(C16,Verenigingen!A2:B450,2,FALSE),\"Onbekend\"))","v":""},"Extra bijdrage ",null,null,null,null,null,null,"=",null,null,0,{"$f":"IF(O16=3,0,IF(C16=\"\",0,LEN(C16)))","v":0},{"$f":"IF(D16=\"Onbekend\",1,0)","v":0},null,null,null,null,null,null,null,null,null,null,null,null,null,null,null,"De naam van de speciaalclub nog invullen (niet verplicht) ",null,"C17"]
[">>>","Lid Speciaalclub: (naam)",null,null,"U komt met het hier achterstaande aantal eigen kooien:",null,null,null,null,null,null,{"$f":"G67-M66","v":0},"=====+",null,0,{"$f":"IF(O17=3,0,IF(C17=\"\",0,LEN(C17)))","v":0},null,null,null,null,null,null,null,null,null,null,null,null,null,null,null,null,"Jeugdinzender Ja/Nee nog aangeven (verplicht) ",null,"C18"]
[">>>","Jeugdinzender: (Ja/Nee)",null,"Jeugdinzender",{"$f":"IF('Inschijfgeld ed'!B45=\"Aan\",'Inschijfgeld ed'!A52,\"\")","v":"Maak uw Keuze:"},null,null,null,null,null,null,"Te betalen:",{"$f":"SUM(M9:M16)","v":5},null,{"$f":"IF(C18=\"Ja\",1,IF(C18=\"Nee\",2,IF(C18=\"\",3)))","v":3},{"$f":"IF(C18= \"Ja\",1,0)","v":0},null,null,null,null,null,null,null,null,null,null,null,null,null,null,null,null,"Bij jeugdinzender \"Ja\" geboorte datum invullen (DD-MM-JJJJ) (verplicht) ",null,"C19"]
[">>>","Geboortedatum:",null,null,{"$f":" \"Sluiting inschrijving: \" &'Inschijfgeld ed'!B33","v":"Sluiting inschrijving: 12 oktober 2021"},{"$f":" \"Sluiting inschrijving: \" &'Inschijfgeld ed'!C34","v":"Sluiting inschrijving: "},{"$f":" \"Sluiting inschrijving: \" &'Inschijfgeld ed'!D34","v":"Sluiting inschrijving: "},{"$f":" \"Sluiting inschrijving: \" &'Inschijfgeld ed'!E34","v":"Sluiting inschrijving: "},{"$f":" \"Sluiting inschrijving: \" &'Inschijfgeld ed'!F34","v":"Sluiting inschrijving: "},{"$f":" \"Sluiting inschrijving: \" &'Inschijfgeld ed'!G34","v":"Sluiting inschrijving: "},{"$f":" \"Sluiting inschrijving: \" &'Inschijfgeld ed'!H34","v":"Sluiting inschrijving: "},{"$f":" \"Sluiting inschrijving: \" &'Inschijfgeld ed'!I34","v":"Sluiting inschrijving: "},{"$f":" \"Sluiting inschrijving: \" &'Inschijfgeld ed'!J34","v":"Sluiting inschrijving: "},null,{"$f":"LEN(C19)","v":0}]
[null,"KLASSE","Soort  en/of Kleurslag van de Vogel",null,"Soort","Aantal","Aantal","Aantal","Aantal","Aantal","Aantal","Verz.","Aantal",null,null,null,null,null,null,"Totaal",null,null,null,null,null,null,null,null,null,null,null,null,"U heeft uw E-mailadres nog niet ingevuld (Verplicht bij verzenden via E-mail)",null,"C77"]
[null,"Intikken zonder punten of komma's","Wordt automatisch ingevuld als u de juiste klasse intikt.",null,"kooi","jaren","Enkelingen","Stellen","Stammen","O.E.K.","O.K.","Bedrag ","Huurkooien",null,"Enk.","Stel","Stam","OEK","OK","vogels","Klasse","Omsch.","T+U","Kolom B","Kolom T","W+X",null,"Verz."]
[">>>",null,{"$f":"IF(B22=\"\",\"\",IF(ISERROR(VLOOKUP(Inschrijfformulier!B22,Vraagprogramma!A:B,2,FALSE)),\"Onbekend\",(VLOOKUP(Inschrijfformulier!B22,Vraagprogramma!A:B,2,FALSE))))","v":""},null,{"$f":"IF(24=\" \",\" \",IF(ISERROR(VLOOKUP(Inschrijfformulier!C22,Vraagprogramma!B:D,3,FALSE)),\" \",(VLOOKUP(Inschrijfformulier!C22,Vraagprogramma!B:D,3,FALSE))))","v":" "},{"$f":"IF(24=\" \",\" \",IF(ISERROR(VLOOKUP(Inschrijfformulier!C22,Vraagprogramma!B:E,4,FALSE)),\" \",(VLOOKUP(Inschrijfformulier!C22,Vraagprogramma!B:E,4,FALSE))))","v":" "},null,null,null,null,null,null,null,{"$f":"IF(T22>0,1,0)","v":0},{"$f":"LEN(G22)","v":0},{"$f":"LEN(H22)","v":0},{"$f":"LEN(I22)","v":0},{"$f":"LEN(J22)","v":0},{"$f":"LEN(K22)","v":0},{"$f":"G22+(H22*2)+(I22*4)+J22+K22","v":0},{"$f":"IF(B22=\"\",0,1)","v":0},{"$f":"IF(C22=\"Onbekend\",1,0)","v":0},{"$f":"T22+U22","v":0},{"$f":"IF(B22<>\"\",1,0)","v":0},{"$f":"IF(T22>0,1,0)","v":0},{"$f":"IF(Y22=1,IF(X22=1,2,1),0)","v":0},{"$f":"AB22+U22+N22","v":0},{"$f":"IF(L22<>\"\",1,0)","v":0},{"$f":"AA22+AB22","v":0},{"$f":"IF(AC22=0,1,0)","v":1},{"$f":"IF(AD22=1,0,0)","v":0},null,"INVOEREN VOGELS",null,"VB"]
[">>>",null,{"$f":"IF(B23=\"\",\"\",IF(ISERROR(VLOOKUP(Inschrijfformulier!B23,Vraagprogramma!A:B,2,FALSE)),\"Onbekend\",(VLOOKUP(Inschrijfformulier!B23,Vraagprogramma!A:B,2,FALSE))))","v":""},null,{"$f":"IF(24=\" \",\" \",IF(ISERROR(VLOOKUP(Inschrijfformulier!C23,Vraagprogramma!B:D,3,FALSE)),\" \",(VLOOKUP(Inschrijfformulier!C23,Vraagprogramma!B:D,3,FALSE))))","v":" "},{"$f":"IF(24=\" \",\" \",IF(ISERROR(VLOOKUP(Inschrijfformulier!C23,Vraagprogramma!B:E,4,FALSE)),\" \",(VLOOKUP(Inschrijfformulier!C23,Vraagprogramma!B:E,4,FALSE))))","v":" "},null,null,null,null,null,null,null,{"$f":"IF(T23>0,1,0)","v":0},0,0,0,0,0,0,0,{"$f":"IF(C23=\"Onbekend\",1,0)","v":0},0,0,0,{"$f":"IF(Y23=1,IF(X23=1,2,1),0)","v":0},0,0,{"$f":"AA23+AB23","v":0},1,0,null,"- Kolommen B22 tm B60 moet aansluitend gevuld worden",null,"LET OP !"]
[">>>",null,{"$f":"IF(B24=\"\",\"\",IF(ISERROR(VLOOKUP(Inschrijfformulier!B24,Vraagprogramma!A:B,2,FALSE)),\"Onbekend\",(VLOOKUP(Inschrijfformulier!B24,Vraagprogramma!A:B,2,FALSE))))","v":""},null,{"$f":"IF(24=\" \",\" \",IF(ISERROR(VLOOKUP(Inschrijfformulier!C24,Vraagprogramma!B:D,3,FALSE)),\" \",(VLOOKUP(Inschrijfformulier!C24,Vraagprogramma!B:D,3,FALSE))))","v":" "},{"$f":"IF(24=\" \",\" \",IF(ISERROR(VLOOKUP(Inschrijfformulier!C24,Vraagprogramma!B:E,4,FALSE)),\" \",(VLOOKUP(Inschrijfformulier!C24,Vraagprogramma!B:E,4,FALSE))))","v":" "},null,null,null,null,null,null,null,0,0,0,0,0,0,0,0,0,0,0,0,0,0,0,0,1,0,null,"- Als u de vogels welke u wilt inschrijven correct zijn ingeschreven zal voor de ",null,">>>"]
[">>>",null,{"$f":"IF(B25=\"\",\"\",IF(ISERROR(VLOOKUP(Inschrijfformulier!B25,Vraagprogramma!A:B,2,FALSE)),\"Onbekend\",(VLOOKUP(Inschrijfformulier!B25,Vraagprogramma!A:B,2,FALSE))))","v":""},null,{"$f":"IF(24=\" \",\" \",IF(ISERROR(VLOOKUP(Inschrijfformulier!C25,Vraagprogramma!B:D,3,FALSE)),\" \",(VLOOKUP(Inschrijfformulier!C25,Vraagprogramma!B:D,3,FALSE))))","v":" "},{"$f":"IF(24=\" \",\" \",IF(ISERROR(VLOOKUP(Inschrijfformulier!C25,Vraagprogramma!B:E,4,FALSE)),\" \",(VLOOKUP(Inschrijfformulier!C25,Vraagprogramma!B:E,4,FALSE))))","v":" "},null,null,null,null,null,null,null,0,0,0,0,0,0,0,0,0,0,0,0,0,0,0,0,1,0,null,"klasse het vakje groen worden. (kolom A)"]
[">>>",null,{"$f":"IF(B26=\"\",\"\",IF(ISERROR(VLOOKUP(Inschrijfformulier!B26,Vraagprogramma!A:B,2,FALSE)),\"Onbekend\",(VLOOKUP(Inschrijfformulier!B26,Vraagprogramma!A:B,2,FALSE))))","v":""},null,{"$f":"IF(24=\" \",\" \",IF(ISERROR(VLOOKUP(Inschrijfformulier!C26,Vraagprogramma!B:D,3,FALSE)),\" \",(VLOOKUP(Inschrijfformulier!C26,Vraagprogramma!B:D,3,FALSE))))","v":" "},{"$f":"IF(24=\" \",\" \",IF(ISERROR(VLOOKUP(Inschrijfformulier!C26,Vraagprogramma!B:E,4,FALSE)),\" \",(VLOOKUP(Inschrijfformulier!C26,Vraagprogramma!B:E,4,FALSE))))","v":" "},null,null,null,null,null,null,null,0,0,0,0,0,0,0,0,0,0,0,0,0,0,0,0,1,{"$f":"IF(AD26=1,0,0)","v":0},null,"- Als nog niet alles is ingevuld zal het vakje voor de klasse roze/bruin kleuren.",null,">>>"]
[">>>",null,{"$f":"IF(B27=\"\",\"\",IF(ISERROR(VLOOKUP(Inschrijfformulier!B27,Vraagprogramma!A:B,2,FALSE)),\"Onbekend\",(VLOOKUP(Inschrijfformulier!B27,Vraagprogramma!A:B,2,FALSE))))","v":""},null,{"$f":"IF(24=\" \",\" \",IF(ISERROR(VLOOKUP(Inschrijfformulier!C27,Vraagprogramma!B:D,3,FALSE)),\" \",(VLOOKUP(Inschrijfformulier!C27,Vraagprogramma!B:D,3,FALSE))))","v":" "},{"$f":"IF(24=\" \",\" \",IF(ISERROR(VLOOKUP(Inschrijfformulier!C27,Vraagprogramma!B:E,4,FALSE)),\" \",(VLOOKUP(Inschrijfformulier!C27,Vraagprogramma!B:E,4,FALSE))))","v":" "},null,null,null,null,null,null,null,0,0,0,0,0,0,0,0,0,0,0,0,0,0,0,0,1,{"$f":"IF(AD27=1,0,0)","v":0},null,"- Als in de kolom (B22 t/m B65) een dubbele klasse ingevoerd wordt,worden",null,1001001]
[">>>",null,{"$f":"IF(B28=\"\",\"\",IF(ISERROR(VLOOKUP(Inschrijfformulier!B28,Vraagprogramma!A:B,2,FALSE)),\"Onbekend\",(VLOOKUP(Inschrijfformulier!B28,Vraagprogramma!A:B,2,FALSE))))","v":""},null,{"$f":"IF(24=\" \",\" \",IF(ISERROR(VLOOKUP(Inschrijfformulier!C28,Vraagprogramma!B:D,3,FALSE)),\" \",(VLOOKUP(Inschrijfformulier!C28,Vraagprogramma!B:D,3,FALSE))))","v":" "},{"$f":"IF(24=\" \",\" \",IF(ISERROR(VLOOKUP(Inschrijfformulier!C28,Vraagprogramma!B:E,4,FALSE)),\" \",(VLOOKUP(Inschrijfformulier!C28,Vraagprogramma!B:E,4,FALSE))))","v":" "},null,null,null,null,null,null,null,0,0,0,0,0,0,0,0,0,0,0,0,0,0,0,0,1,0,null,"de vakjes roze met rode letter verschijnen. U mag maar 1 regel per "]
[">>>",null,{"$f":"IF(B29=\"\",\"\",IF(ISERROR(VLOOKUP(Inschrijfformulier!B29,Vraagprogramma!A:B,2,FALSE)),\"Onbekend\",(VLOOKUP(Inschrijfformulier!B29,Vraagprogramma!A:B,2,FALSE))))","v":""},null,{"$f":"IF(24=\" \",\" \",IF(ISERROR(VLOOKUP(Inschrijfformulier!C29,Vraagprogramma!B:D,3,FALSE)),\" \",(VLOOKUP(Inschrijfformulier!C29,Vraagprogramma!B:D,3,FALSE))))","v":" "},{"$f":"IF(24=\" \",\" \",IF(ISERROR(VLOOKUP(Inschrijfformulier!C29,Vraagprogramma!B:E,4,FALSE)),\" \",(VLOOKUP(Inschrijfformulier!C29,Vraagprogramma!B:E,4,FALSE))))","v":" "},null,null,null,null,null,null,null,0,0,0,0,0,0,0,0,0,0,0,0,0,0,0,0,1,0,null,"klasse gebruiken. Verwijder dus 1 regel en zet de aantallen bij de eerste regel."]
[">>>",null,{"$f":"IF(B30=\"\",\"\",IF(ISERROR(VLOOKUP(Inschrijfformulier!B30,Vraagprogramma!A:B,2,FALSE)),\"Onbekend\",(VLOOKUP(Inschrijfformulier!B30,Vraagprogramma!A:B,2,FALSE))))","v":""},null,{"$f":"IF(24=\" \",\" \",IF(ISERROR(VLOOKUP(Inschrijfformulier!C30,Vraagprogramma!B:D,3,FALSE)),\" \",(VLOOKUP(Inschrijfformulier!C30,Vraagprogramma!B:D,3,FALSE))))","v":" "},{"$f":"IF(24=\" \",\" \",IF(ISERROR(VLOOKUP(Inschrijfformulier!C30,Vraagprogramma!B:E,4,FALSE)),\" \",(VLOOKUP(Inschrijfformulier!C30,Vraagprogramma!B:E,4,FALSE))))","v":" "},null,null,null,null,null,null,null,0,0,0,0,0,0,0,0,0,0,0,0,0,0,0,0,1,0]
{"$rows_left_out":52}
{"sheet":"Vraagprogramma","index":1,"n_rows":6842,"n_cols":8,"rows_kept":6842,"cut":false,"hidden":false,"merged":[[0,0,0,4],[0,6,0,7]]}
["VRAAGPROGRAMMA 2020-2024 (VERSIE JANUARI 2021)",null,null,null,null,null,"UITLEG, HOE GEBRUIKT U DE ZOEKFUNCTIE"]
["Klasse","Soort",null,"Kooi","Aantal jaar",null,"Om in deze lijst te kunnen zoeken naar een klasse-nummer kunt u de zoekfunctie gebruiken."]
[1001001,"ZangKan.Harzer kloekvrij",null,1,1,null,"Deze zoekfunctie activeert u door de CTRL-knop op uw toetsenbord ingedrukt te houden"]
[1001002,"ZangKan.Harzer met kloeken",null,1,1,null,"en dan vervolgens op de letter F te klikken. Dan verschijnt het hieronder staand scherm."]
[1002001,"ZangKan.Waterslagers",null,1,1]
[1003001,"ZangKan.Timbrado original",null,1,2]
[1003002,"ZangKan.Timbrado floreado",null,1,2]
[2001001,"Kl.Kan.Lipochroom wit dominant",null,2,2]
[2002001,"Kl.Kan.Lipochroom wit",null,2,2]
[2003001,"Kl.Kan.Lipochroom albino dominant",null,2,2]
[2003002,"Kl.Kan.Lipochroom albino",null,2,2]
[2005001,"Kl.Kan.Lipochroom geel intensief",null,2,2,null,"Vervolgens kunt u in het vakje achter \"Zoeken naar\" de naam, of een gedeelte daarvan, van de"]
[2005002,"Kl.Kan.Lipochroom geelivoor intensief",null,2,2,null,"gewenste vogel intikken. Vervolgens klikt u met uw muis op de knop \"Volgende zoeken\"."]
[2005003,"Kl.Kan.Lipochroom geel intensief witte pennen",null,2,2,null,"Als u dan uw vogel gevonden heeft staat voor de naam het klasse-nummer en dit nummer gebruikt"]
[2005004,"Kl.Kan.Lipochroom geelivoor intensief witte pennen",null,2,2,null,"u vervolgens in het tabblad \"Inschrijfformulier\". En als u dit klasse-nummer heeft ingetikt (niet kopieren/plakken)"]
[2007001,"Kl.Kan.Lipochroom lutino intensief",null,2,2,null,"verschijnt de naam van uw vogel in het vakje er naast."]
[2007002,"Kl.Kan.Lipochroom lutino-ivoor intensief",null,2,2,null,"Heeft u nog niet de juiste vogel gevonden dan klikt u met uw muis weer op de knop \"Volgende zoeken\""]
[2007003,"Kl.Kan.Lipochroom lutino intensief witte pennen",null,2,2,null,"Dit doet u net zolang tot dat u uw gewenste vogel gevonden heeft."]
[2007004,"Kl.Kan.Lipochroom lutino-ivoor int.witte pennen",null,2,2,null,"Als u klaar bent met zoeken kunt u, in het zoekscherm op de knop \"Sluiten\" klikken met uw muis."]
[2009001,"Kl.Kan.Lipochroom geel schimmel",null,2,2]
[2009002,"Kl.Kan.Lipochroom geelivoor schimmel",null,2,2,null,"In de kolom:"]
[2009003,"Kl.Kan.Lipochroom geel schimmel witte pennen",null,2,2,null,"Klasse (kolom A):","Staat het klasse-nummer, voor het gewenste klasse-nummer in (kolom B, regel 22 t/m 60)"]
[2009004,"Kl.Kan.Lipochroom geelivoor schimmel witte pennen",null,2,2,null,null,"in het tabblad \"Inschrijfformulier\"."]
[2011001,"Kl.Kan.Lipochroom lutino schimmel",null,2,2,null,"Soort (kolom B): ","Staat de naam en eventueel de kleurslag (*)."]
[2011002,"Kl.Kan.Lipochroom lutino-ivoor schimmel",null,2,2,null,"Kooi (kolom C):","Staat het nummer van de soortkooi waar de vogel in tentoongesteld moet worden (*)."]
[2011003,"Kl.Kan.Lipochroom lutino schimmel witte pennen",null,2,2,null,"Aantal jaar (kolom D):","Staat hoeveel jaar een vogel mee mag doen als eigenkweekvogel (*)."]
[2011004,"Kl.Kan.Lipochroom lutino-ivoor schimmel witte pennen",null,2,2]
[2013001,"Kl.Kan.Lipochroom geel mozaiek T1",null,2,2,null,null,"(*) Deze gegevens worden automatisch in het tabblad \"Inschrijfformulier\" in de juiste vakken"]
[2013002,"Kl.Kan.Lipochroom lutino mozaiek T1",null,2,2,null,null,"ingevoerd als u het klasse-nummer in het tabblad \"Inschrijfformulier\" heeft ingevoerd."]
[2013003,"Kl.Kan.Lipochroom geelivoor mozaiek T1",null,2,2]
{"$rows_left_out":6813}
{"sheet":"Handleiding","index":2,"n_rows":78,"n_cols":8,"rows_kept":78,"cut":false,"hidden":false,"merged":[[69,0,69,12],[66,2,66,8],[70,0,70,8],[71,0,71,8],[72,0,72,8],[68,0,68,8],[54,2,54,8],[44,2,44,12],[46,2,46,12],[48,2,48,12],[49,2,49,12],[60,2,60,12],[62,0,62,12],[26,0,26,8],[23,2,23,8],[8,0,8,8],[13,2,13,8],[14,2,14,8],[15,2,15,8],[17,2,17,8],[20,2,20,8],[27,0,27,12],[28,0,28,12],[47,2,47,8],[56,2,56,8],[51,2,51,8],[53,2,53,8],[75,0,75,8],[35,0,35,8],[36,0,36,8],[50,2,50,8],[52,2,52,8],[55,2,55,8],[57,2,57,8],[42,2,42,8],[39,0,39,8],[40,0,40,8],[58,2,58,12],[59,2,59,8],[63,0,63,8],[65,0,65,8],[61,0,61,8],[64,0,64,8],[73,0,73,12],[1,0,1,12],[0,0,0,12],[32,0,32,12],[38,0,38,12],[37,0,37,12],[41,2,41,12],[43,2,43,12],[21,2,21,8],[9,2,9,8],[10,2,10,8],[11,2,11,8],[6,0,6,8],[12,2,12,8],[16,2,16,8],[7,0,7,8]]}
["Handleiding invullen van het inschrijfformulier"]
["Wat moet u allemaal invullen om een zo'n compleet mogelijk inschrijfformulier in te leveren"]
[]
["Het Digitale inschrijfformulier is gemaakt om het voor u en uw TT-Secretaris zo gemakkelijk mogelijk te maken."]
["Er zijn diverse controles ingebouwd zodat u niets kunt vergeten om dit formulier goed in te kunnen vullen, succes."]
["LET OP! een APOSTROF ( ' ) mag in de tekstvakken niet gebruikt worden en een spatie is ook een karakter."]
[]
["NAW-gegevens"]
["Hieronder vul jij de diverse gevraagde gegevens in"]
["Kweeknummer:",":","Vul hier uw kweeknummer in (verplicht - 4 karakters)"]
["Ander C.O.M. nummer:",":","Vul hier een ander kweeknummer dan uw NBvV-kweeknummer in (niet verplicht - max.10 karakters)"]
["Naam:",":","Vul hier uw naam in (verplicht - max.45 karakters)"]
["Adres:",":","Vul hier uw adres in (verplicht - max.30 karakters)"]
["Postcode:",":","Vul hier uw postcode in (verplicht - max.7 karakters)"]
["Woonplaats:",":","Vul hier uw woonplaats in (verplicht - max.30 karakters)"]
["Telefoonnummer: ",":","Vul hier uw telefoonnummer in (verplicht - max.20 karakters)"]
["Mobielnummer: ",":","Vul hier uw mobielnummer in (verplicht - max.20 karakters)"]
["Lid afdeling: (code)",":","Vul hier de code van de vereniging in waar u lid van bent (verplicht - 3 karakters)"]
[null,null,"Als u de juiste code van uw vereniging heeft ingevuld verschijnt de naam en plaats van uw vereniging"]
[null,null,"Komt er \"Onbekend\" te staan is de verenigingscode waarschijnlijk fout. Probeer het opnieuw."]
["Lid Speciaalclub: (naam)",":","Vul hier de naam van de speciaalclub of code in waar u ook lid van bent (niet verplicht)"]
["Jeugdinzender: (Ja/Nee)",":","Vul hier \"Ja\" in als u een jeugdinzender bent (niet verplicht - Ja of Nee)"]
[null,null,"Maak hiervoor uw keuze in met de dropdownbox, welke rechts naast \"Jeugdinzender (Ja/Nee) zichtbaar is."]
["Geboortedatum:",":","Als uw \"Ja\" bij jeugdinzender hebt ingevuld moet jij uw geboortedatum invullen (alleen verplicht bij \"Ja\")"]
["Maak uw keuze:",":  Indien \"Maak uw keuze\" zichtbaar is kunt u in het vak rechts ernaast aangeven wat uw wens is."]
[null,null,"Maak hiervoor uw keuze in de dropdownbox, welke rechts naast \"Maak uw Keuze\" zichtbaar is."]
[]
["Als u het bovenstaande allemaal heeft ingevuld dan kunt u vervolgens uw vogels inschrijven welke u in wil zenden voor de "]
["tentoonstelling. U gebruik 1 regel per vogelsoort. Als U twee, of meer regels, gebruikt voor de zelfde klasse wordt het vakje"]
["waar u een klasse nummer hebt ingevoerd roze met rode letter. U moet dan vervolgens de teveel gebruikt regels met de zelfde"]
{"$rows_left_out":49}
{"sheet":"Verenigingen","index":3,"n_rows":455,"n_cols":6,"rows_kept":455,"cut":false,"hidden":true,"merged":[]}
["Ver.Code (3)","Verenigingsnaam/plaats "]
[109,"v.v. Kampen 2 - Kampen 2",null,null,{"$f":"IFERROR(VLOOKUP(D2,#REF!,2,FALSE),\"\")","v":""},{"$f":"IFERROR(VLOOKUP(#REF!,#REF!,2,FALSE),\"\")","v":""}]
[113,"v.v. Vries - Vries"]
[218,"v.v. Utrecht 1 - Utrecht 1"]
[219,"v.v. Utrecht 2 - Utrecht 2"]
[305,"v.v. Delden - Delden"]
[308,"v.v. Bennekom - Bennekom"]
[311,"v.v. Didam 2 - Didam 2"]
[312,"v.v. Beckum - Beckum"]
[314,"v.v. Ede - Ede"]
[319,"v.v. Ons Genoegen - Haaksbergen 2"]
[320,"v.v. Hattem - Hattem"]
[324,"v.v. De Gevleugelde Zanger - Lichtenvoorde"]
[326,"v.v. Losser - Losser"]
[332,"v.v. Oldenzaal 3 - Oldenzaal 3"]
[334,"v.v. Doesburg 2 - Doesburg 2"]
[335,"v.v. Ruurlo - Ruurlo"]
[336,"v.v. Rijssen 3 - Rijssen 3"]
[340,"v.v. Apeldoorn 4 - Apeldoorn 4"]
[341,"v.v. Velp - Velp"]
[342,"v.v. Vorden - Vorden"]
[343,"v.v. Vriezenveen 2 - Vriezenveen 2"]
[350,"v.v. Zelhem - Zelhem"]
[355,"v.v. Eibergen - Eibergen"]
[358,"v.v. Zwolle - Zwolle 4"]
[361,"v.v. Tolkamer - Tolkamer"]
[402,"v.v. Exparka - Belfeld"]
[408,"v.v. Kerkrade - Kerkrade 6"]
[409,"v.v. Leudal - Leudal"]
[411,"v.v. VVWM - Elsloo 2"]
{"$rows_left_out":426}
{"sheet":"Inschijfgeld ed","index":4,"n_rows":55,"n_cols":2,"rows_kept":55,"cut":false,"hidden":true,"merged":[[22,0,22,1],[1,0,1,1],[0,0,0,1],[5,0,5,1],[6,0,6,1],[10,0,10,1],[14,0,14,1],[18,0,18,1]]}
["Alleen de gele gemarkeerde vakken aanpassen"]
["Jeugd"]
["Jeugd - Ja","Ja"]
["Jeugd - Nee","Nee"]
[]
["Inschrijfgeld"]
["Enkelingen (EK) / Overjarig Eigenkweek (OEK) / Open Klasse (OK)"]
["senioren",1]
["Jeugd",0.5]
[]
["Stammen"]
["senioren",4]
["jeugd",2]
[]
["Stellen"]
["senioren",2]
["jeugd",1]
[]
["catalogus/portokosten"]
["senioren",5]
["jeugd",0]
[]
["Huurkooi"]
["Senioren",2]
["Jeugd",2]
[]
["Verenigingsnaam","v.v De Nachtegaal"]
["Verenigingsplaats","Heerjansdam"]
["Aangesloten bij","AANGESLOTEN BIJ DE NEDERLANDSE BOND VAN VOGELLIEFHEBBERS"]
[]
{"$rows_left_out":25}